Reaction Details
TargetSodium/glucose cotransporter 2
LigandBDBM50315418
Substrate/Competitorn/a
Meas. Tech.ChEMBL_626547 (CHEMBL1108920)
IC50 2.3±n/a nM
Citation Kakinuma, HOi, THashimoto-Tsuchiya, YArai, MKawakita, YFukasawa, YIida, IHagima, NTakeuchi, HChino, YAsami, JOkumura-Kitajima, LIo, FYamamoto, DMiyata, NTakahashi, TUchida, SYamamoto, K (1S)-1,5-anhydro-1-[5-(4-ethoxybenzyl)-2-methoxy-4-methylphenyl]-1-thio-D-glucitol (TS-071) is a potent, selective sodium-dependent glucose cotransporter 2 (SGLT2) inhibitor for type 2 diabetes treatment. J Med Chem53:3247-61 (2010) 
 
Sodium/glucose cotransporter 2
Name:Sodium/glucose cotransporter 2
Type:Protein
Mol. Mass.:72902.00
Organism:Homo sapiens (Human)
Description:P31639
Residue:672
BDBM50315418
NameBDBM50315418
Synonyms:(1S)-1,5-Anhydro-1-[3-(4-ethoxybenzyl)-4-methylphenyl]-1-thio-D-glucitol | CHEMBL1092287
TypeSmall organic molecule
Emp. Form.C22H28O5S
Mol. Mass.404.52
SMILESCCOc1ccc(Cc2cc(ccc2C)[C@@H]2S[C@H](CO)[C@@H](O)[C@H](O)[C@H]2O)cc1