Reaction Details
TargetProstaglandin E2 receptor EP2 subtype
LigandBDBM50315469
Substrate/Competitorn/a
Meas. Tech.ChEMBL_626795 (CHEMBL1107242)
IC50>20000±n/a nM
Citation Zhou, NPolozov, AMO'Connell, MBurgeson, JYu, PZeller, WZhang, JOnua, ERamirez, JPalsdottir, GAHalldorsdottir, GVAndresson, TKiselyov, ASGurney, MSingh, J 1,7-Disubstituted oxyindoles are potent and selective EP(3) receptor antagonists. Bioorg Med Chem Lett20:2658-64 (2010) 
 
Prostaglandin E2 receptor EP2 subtype
Name:Prostaglandin E2 receptor EP2 subtype
Type:Enzyme
Mol. Mass.:39775.71
Organism:Homo sapiens (Human)
Description:P43116
Residue:358
BDBM50315469
NameBDBM50315469
Synonyms:3-(3-hydroxy-1-(naphthalen-2-ylmethyl)-2-oxoindolin-7-yl)-N-(2,4,5-trifluorophenylsulfonyl)acrylamide | CHEMBL1093125
TypeSmall organic molecule
Emp. Form.C28H19F3N2O5S
Mol. Mass.552.521
SMILESOC1C(=O)N(Cc2ccc3ccccc3c2)c2c1cccc2\C=C\C(=O)NS(=O)(=O)c1cc(F)c(F)cc1F