Reaction Details
TargetProstaglandin E2 receptor EP3 subtype
LigandBDBM50315492
Substrate/Competitorn/a
Meas. Tech.ChEMBL_626787 (CHEMBL1107234)
IC50 0.5±n/a nM
Citation Zhou, NPolozov, AMO'Connell, MBurgeson, JYu, PZeller, WZhang, JOnua, ERamirez, JPalsdottir, GAHalldorsdottir, GVAndresson, TKiselyov, ASGurney, MSingh, J 1,7-Disubstituted oxyindoles are potent and selective EP(3) receptor antagonists. Bioorg Med Chem Lett20:2658-64 (2010) 
 
Prostaglandin E2 receptor EP3 subtype
Name:Prostaglandin E2 receptor EP3 subtype
Type:Enzyme
Mol. Mass.:43335.03
Organism:Homo sapiens (Human)
Description:P43115
Residue:390
BDBM50315492
NameBDBM50315492
Synonyms:CHEMBL1092230 | N-(3-chlorophenylsulfonyl)-3-(1-(2,4-dichlorobenzyl)-2-oxoindolin-7-yl)acrylamide
TypeSmall organic molecule
Emp. Form.C24H17Cl3N2O4S
Mol. Mass.535.827
SMILESClc1ccc(CN2C(=O)Cc3cccc(\C=C\C(=O)NS(=O)(=O)c4cccc(Cl)c4)c23)c(Cl)c1