Reaction Details
TargetProstaglandin E2 receptor EP3 subtype
LigandBDBM50315494
Substrate/Competitorn/a
Meas. Tech.ChEMBL_626787 (CHEMBL1107234)
IC50 0.7±n/a nM
Citation Zhou, NPolozov, AMO'Connell, MBurgeson, JYu, PZeller, WZhang, JOnua, ERamirez, JPalsdottir, GAHalldorsdottir, GVAndresson, TKiselyov, ASGurney, MSingh, J 1,7-Disubstituted oxyindoles are potent and selective EP(3) receptor antagonists. Bioorg Med Chem Lett20:2658-64 (2010) 
 
Prostaglandin E2 receptor EP3 subtype
Name:Prostaglandin E2 receptor EP3 subtype
Type:Enzyme
Mol. Mass.:43335.03
Organism:Homo sapiens (Human)
Description:P43115
Residue:390
BDBM50315494
NameBDBM50315494
Synonyms:3-(1-(2,4-dichlorobenzyl)-2-oxoindolin-7-yl)-N-(3,4-difluorophenylsulfonyl)acrylamide | CHEMBL1090113
TypeSmall organic molecule
Emp. Form.C24H16Cl2F2N2O4S
Mol. Mass.537.363
SMILESFc1ccc(cc1F)S(=O)(=O)NC(=O)\C=C\c1cccc2CC(=O)N(Cc3ccc(Cl)cc3Cl)c12