Reaction Details
TargetProstaglandin E2 receptor EP3 subtype
LigandBDBM50315496
Substrate/Competitorn/a
Meas. Tech.ChEMBL_626787 (CHEMBL1107234)
IC50 1.3±n/a nM
Citation Zhou, NPolozov, AMO'Connell, MBurgeson, JYu, PZeller, WZhang, JOnua, ERamirez, JPalsdottir, GAHalldorsdottir, GVAndresson, TKiselyov, ASGurney, MSingh, J 1,7-Disubstituted oxyindoles are potent and selective EP(3) receptor antagonists. Bioorg Med Chem Lett20:2658-64 (2010) 
 
Prostaglandin E2 receptor EP3 subtype
Name:Prostaglandin E2 receptor EP3 subtype
Type:Enzyme
Mol. Mass.:43335.03
Organism:Homo sapiens (Human)
Description:P43115
Residue:390
BDBM50315496
NameBDBM50315496
Synonyms:CHEMBL1088785 | N-(4,5-dichlorothiophen-2-ylsulfonyl)-3-(1-(naphthalen-2-ylmethyl)-2-oxoindolin-7-yl)acrylamide
TypeSmall organic molecule
Emp. Form.C26H18Cl2N2O4S2
Mol. Mass.557.468
SMILESClc1cc(sc1Cl)S(=O)(=O)NC(=O)\C=C\c1cccc2CC(=O)N(Cc3ccc4ccccc4c3)c12