Reaction Details
TargetProstaglandin E2 receptor EP3 subtype
LigandBDBM50315500
Substrate/Competitorn/a
Meas. Tech.ChEMBL_626787 (CHEMBL1107234)
IC50 0.5±n/a nM
Citation Zhou, NPolozov, AMO'Connell, MBurgeson, JYu, PZeller, WZhang, JOnua, ERamirez, JPalsdottir, GAHalldorsdottir, GVAndresson, TKiselyov, ASGurney, MSingh, J 1,7-Disubstituted oxyindoles are potent and selective EP(3) receptor antagonists. Bioorg Med Chem Lett20:2658-64 (2010) 
 
Prostaglandin E2 receptor EP3 subtype
Name:Prostaglandin E2 receptor EP3 subtype
Type:Enzyme
Mol. Mass.:43335.03
Organism:Homo sapiens (Human)
Description:P43115
Residue:390
BDBM50315500
NameBDBM50315500
Synonyms:CHEMBL1088823 | N-(3,4-dichlorophenylsulfonyl)-3-(1-(naphthalen-2-ylmethyl)-2-oxoindolin-7-yl)acrylamide
TypeSmall organic molecule
Emp. Form.C28H20Cl2N2O4S
Mol. Mass.551.44
SMILESClc1ccc(cc1Cl)S(=O)(=O)NC(=O)\C=C\c1cccc2CC(=O)N(Cc3ccc4ccccc4c3)c12