Reaction Details
TargetProstaglandin E2 receptor EP3 subtype
LigandBDBM50315529
Substrate/Competitorn/a
Meas. Tech.ChEMBL_626788 (CHEMBL1107235)
IC50 2.8±n/a nM
Citation Zhou, NPolozov, AMO'Connell, MBurgeson, JYu, PZeller, WZhang, JOnua, ERamirez, JPalsdottir, GAHalldorsdottir, GVAndresson, TKiselyov, ASGurney, MSingh, J 1,7-Disubstituted oxyindoles are potent and selective EP(3) receptor antagonists. Bioorg Med Chem Lett20:2658-64 (2010) 
 
Prostaglandin E2 receptor EP3 subtype
Name:Prostaglandin E2 receptor EP3 subtype
Type:Enzyme
Mol. Mass.:43335.03
Organism:Homo sapiens (Human)
Description:P43115
Residue:390
BDBM50315529
NameBDBM50315529
Synonyms:CHEMBL1089454 | N-(3-chlorophenylsulfonyl)-3-(3-methyl-1-(naphthalen-2-ylmethyl)-2-oxoindolin-7-yl)acrylamide
TypeSmall organic molecule
Emp. Form.C29H23ClN2O4S
Mol. Mass.531.022
SMILESCC1C(=O)N(Cc2ccc3ccccc3c2)c2c1cccc2\C=C\C(=O)NS(=O)(=O)c1cccc(Cl)c1