Reaction Details
TargetProstaglandin E2 receptor EP3 subtype
LigandBDBM50315522
Substrate/Competitorn/a
Meas. Tech.ChEMBL_626787 (CHEMBL1107234)
IC50 0.9±n/a nM
Citation Zhou, NPolozov, AMO'Connell, MBurgeson, JYu, PZeller, WZhang, JOnua, ERamirez, JPalsdottir, GAHalldorsdottir, GVAndresson, TKiselyov, ASGurney, MSingh, J 1,7-Disubstituted oxyindoles are potent and selective EP(3) receptor antagonists. Bioorg Med Chem Lett20:2658-64 (2010) 
 
Prostaglandin E2 receptor EP3 subtype
Name:Prostaglandin E2 receptor EP3 subtype
Type:Enzyme
Mol. Mass.:43335.03
Organism:Homo sapiens (Human)
Description:P43115
Residue:390
BDBM50315522
NameBDBM50315522
Synonyms:3-(1-(2,4-dichlorobenzyl)-3-methyl-2-oxoindolin-7-yl)-N-(3,4-dichlorophenylsulfonyl)acrylamide | CHEMBL1090507
TypeSmall organic molecule
Emp. Form.C25H18Cl4N2O4S
Mol. Mass.584.298
SMILESCC1C(=O)N(Cc2ccc(Cl)cc2Cl)c2c1cccc2\C=C\C(=O)NS(=O)(=O)c1ccc(Cl)c(Cl)c1