Reaction Details
TargetProstaglandin E2 receptor EP3 subtype
LigandBDBM50315505
Substrate/Competitorn/a
Meas. Tech.ChEMBL_626788 (CHEMBL1107235)
IC50 42±n/a nM
Citation Zhou, NPolozov, AMO'Connell, MBurgeson, JYu, PZeller, WZhang, JOnua, ERamirez, JPalsdottir, GAHalldorsdottir, GVAndresson, TKiselyov, ASGurney, MSingh, J 1,7-Disubstituted oxyindoles are potent and selective EP(3) receptor antagonists. Bioorg Med Chem Lett20:2658-64 (2010) 
 
Prostaglandin E2 receptor EP3 subtype
Name:Prostaglandin E2 receptor EP3 subtype
Type:Enzyme
Mol. Mass.:43335.03
Organism:Homo sapiens (Human)
Description:P43115
Residue:390
BDBM50315505
NameBDBM50315505
Synonyms:3-(1-(3,4-difluorobenzyl)-2-oxoindolin-7-yl)-N-(2,4,5-trifluorophenylsulfonyl)acrylamide | CHEMBL1091145
TypeSmall organic molecule
Emp. Form.C24H15F5N2O4S
Mol. Mass.522.444
SMILESFc1ccc(CN2C(=O)Cc3cccc(\C=C\C(=O)NS(=O)(=O)c4cc(F)c(F)cc4F)c23)cc1F