Reaction Details
TargetSphingosine 1-phosphate receptor 1
LigandBDBM50315554
Substrate/Competitorn/a
Meas. Tech.ChEMBL_627320 (CHEMBL1108112)
IC50 500±n/a nM
Citation Evindar, GBernier, SGDoyle, EKavarana, MJSatz, ALLorusso, JBlanchette, HSSaha, AKHannig, GMorgan, BAWestlin, WF Exploration of amino alcohol derivatives as novel, potent, and highly selective sphingosine-1-phosphate receptor subtype-1 agonists. Bioorg Med Chem Lett20:2520-4 (2010) 
 
Sphingosine 1-phosphate receptor 1
Name:Sphingosine 1-phosphate receptor 1
Type:Enzyme
Mol. Mass.:42836.02
Organism:Homo sapiens (Human)
Description:P21453
Residue:382
BDBM50315554
NameBDBM50315554
Synonyms:(S)-2-amino-3-(4-(2-(biphenyl-4-yl)ethoxy)-3-(methylcarbamoyl)phenylamino)-2-methyl-3-oxopropyl dihydrogen phosphate | CHEMBL1090782
TypeSmall organic molecule
Emp. Form.C26H30N3O7P
Mol. Mass.527.5061
SMILESCNC(=O)c1cc(NC(=O)[C@@](C)(N)COP(O)(O)=O)ccc1OCCc1ccc(cc1)-c1ccccc1