Reaction Details
TargetSphingosine 1-phosphate receptor 5
LigandBDBM50315559
Substrate/Competitorn/a
Meas. Tech.ChEMBL_627323 (CHEMBL1108115)
IC50 87.2±n/a nM
Citation Evindar, GBernier, SGDoyle, EKavarana, MJSatz, ALLorusso, JBlanchette, HSSaha, AKHannig, GMorgan, BAWestlin, WF Exploration of amino alcohol derivatives as novel, potent, and highly selective sphingosine-1-phosphate receptor subtype-1 agonists. Bioorg Med Chem Lett20:2520-4 (2010) 
 
Sphingosine 1-phosphate receptor 5
Name:Sphingosine 1-phosphate receptor 5
Type:G Protein-Coupled Receptor (GPCR)
Mol. Mass.:41796.42
Organism:Homo sapiens (Human)
Description:n/a
Residue:398
BDBM50315559
NameBDBM50315559
Synonyms:(S)-2-amino-3-(4-(2-(biphenyl-4-yl)ethoxy)-3-(trifluoromethyl)phenylamino)-2-methyl-3-oxopropyl dihydrogen phosphate | CHEMBL1093429
TypeSmall organic molecule
Emp. Form.C25H26F3N2O6P
Mol. Mass.538.4527
SMILESC[C@](N)(COP(O)(O)=O)C(=O)Nc1ccc(OCCc2ccc(cc2)-c2ccccc2)c(c1)C(F)(F)F