Reaction Details
TargetSphingosine 1-phosphate receptor 5
LigandBDBM50315562
Substrate/Competitorn/a
Meas. Tech.ChEMBL_627323 (CHEMBL1108115)
IC50 9.6±n/a nM
Citation Evindar, GBernier, SGDoyle, EKavarana, MJSatz, ALLorusso, JBlanchette, HSSaha, AKHannig, GMorgan, BAWestlin, WF Exploration of amino alcohol derivatives as novel, potent, and highly selective sphingosine-1-phosphate receptor subtype-1 agonists. Bioorg Med Chem Lett20:2520-4 (2010) 
 
Sphingosine 1-phosphate receptor 5
Name:Sphingosine 1-phosphate receptor 5
Type:G Protein-Coupled Receptor (GPCR)
Mol. Mass.:41796.42
Organism:Homo sapiens (Human)
Description:n/a
Residue:398
BDBM50315562
NameBDBM50315562
Synonyms:(R)-2-amino-2-(4-(4-(biphenyl-4-ylmethoxy)-3-(trifluoromethyl)phenyl)-1H-imidazol-2-yl)propyl dihydrogen phosphate | CHEMBL1093823
TypeSmall organic molecule
Emp. Form.C26H25F3N3O5P
Mol. Mass.547.4628
SMILESC[C@](N)(COP(O)(O)=O)c1nc(c[nH]1)-c1ccc(OCc2ccc(cc2)-c2ccccc2)c(c1)C(F)(F)F