Reaction Details
TargetSphingosine 1-phosphate receptor 1
LigandBDBM50315561
Substrate/Competitorn/a
Meas. Tech.ChEMBL_627326 (CHEMBL1108118)
EC50 22.4±n/a nM
Citation Evindar, GBernier, SGDoyle, EKavarana, MJSatz, ALLorusso, JBlanchette, HSSaha, AKHannig, GMorgan, BAWestlin, WF Exploration of amino alcohol derivatives as novel, potent, and highly selective sphingosine-1-phosphate receptor subtype-1 agonists. Bioorg Med Chem Lett20:2520-4 (2010) 
 
Sphingosine 1-phosphate receptor 1
Name:Sphingosine 1-phosphate receptor 1
Type:Enzyme
Mol. Mass.:42836.02
Organism:Homo sapiens (Human)
Description:P21453
Residue:382
BDBM50315561
NameBDBM50315561
Synonyms:(R)-2-amino-2-(4-(4-(2-(biphenyl-4-yl)ethoxy)-3-(trifluoromethyl)phenyl)-1H-imidazol-2-yl)propyl dihydrogen phosphate | CHEMBL1090829
TypeSmall organic molecule
Emp. Form.C27H27F3N3O5P
Mol. Mass.561.4894
SMILESC[C@](N)(COP(O)(O)=O)c1nc(c[nH]1)-c1ccc(OCCc2ccc(cc2)-c2ccccc2)c(c1)C(F)(F)F