Reaction Details
TargetSerine/threonine-protein kinase mTOR
LigandBDBM50315762
Substrate/Competitorn/a
Meas. Tech.ChEMBL_624247 (CHEMBL1106091)
IC50 0.5±n/a nM
Citation Chen, ZVenkatesan, AMDehnhardt, CMAyral-Kaloustian, SBrooijmans, NMallon, RFeldberg, LHollander, ILucas, JYu, KKong, FMansour, TS Synthesis and SAR of novel 4-morpholinopyrrolopyrimidine derivatives as potent phosphatidylinositol 3-kinase inhibitors. J Med Chem53:3169-82 (2010) 
 
Serine/threonine-protein kinase mTOR
Name:Serine/threonine-protein kinase mTOR
Type:Rapamycin target protein
Mol. Mass.:288917.12
Organism:Homo sapiens (Human)
Description:P42345
Residue:2549
BDBM50315762
NameBDBM50315762
Synonyms:CHEMBL1092402 | N-[2-(Dimethylamino)ethyl]-4-({[4-(7-ethyl-4-morpholin-4-yl-7H-pyrrolo[2,3-d]pyrimidin-2-yl)phenyl]carbamoyl}amino)benzamide
TypeSmall organic molecule
Emp. Form.C30H36N8O3
Mol. Mass.556.6586
SMILESCCn1ccc2c(nc(nc12)-c1ccc(NC(=O)Nc2ccc(cc2)C(=O)NCCN(C)C)cc1)N1CCOCC1