Reaction Details
TargetAurora kinase B
LigandBDBM50315769
Substrate/Competitorn/a
Meas. Tech.ChEMBL_624529 (CHEMBL1110578)
IC50 32±n/a nM
Citation Medina, JRGrant, SWAxten, JMMiller, WHDonatelli, CAHardwicke, MAOleykowski, CALiao, QPlant, RXiang, H Discovery of a new series of Aurora inhibitors through truncation of GSK1070916. Bioorg Med Chem Lett20:2552-5 (2010) 
 
Aurora kinase B
Name:Aurora kinase B
Type:Protein
Mol. Mass.:39327.72
Organism:Homo sapiens (Human)
Description:Q96GD4
Residue:344
BDBM50315769
NameBDBM50315769
Synonyms:3-(4-(4-(2-(3-((dimethylamino)methyl)phenyl)-1H-pyrrolo[2,3-b]pyridin-4-yl)-1-ethyl-1H-pyrazol-3-yl)phenyl)-1,1-dimethylurea CHEMBL1090479 | GSK-1070916
TypeSmall organic molecule
Emp. Form.C30H33N7O
Mol. Mass.507.6293
SMILESCCn1cc(c(n1)-c1ccc(NC(=O)N(C)C)cc1)-c1ccnc2[nH]c(cc12)-c1cccc(CN(C)C)c1