Reaction Details
TargetPoly [ADP-ribose] polymerase 2
LigandBDBM50315798
Substrate/Competitorn/a
Meas. Tech.ChEMBL_626085 (CHEMBL1110690)
Ki 4±n/a nM
Citation Penning, TDZhu, GDGong, JThomas, SGandhi, VBLiu, XShi, YKlinghofer, VJohnson, EFPark, CHFry, EHDonawho, CKFrost, DJBuchanan, FGBukofzer, GTRodriguez, LEBontcheva-Diaz, VBouska, JJOsterling, DJOlson, AMMarsh, KCLuo, YGiranda, VL Optimization of phenyl-substituted benzimidazole carboxamide poly(ADP-ribose) polymerase inhibitors: identification of (S)-2-(2-fluoro-4-(pyrrolidin-2-yl)phenyl)-1H-benzimidazole-4-carboxamide (A-966492), a highly potent and efficacious inhibitor. J Med Chem53:3142-53 (2010) 
 
Poly [ADP-ribose] polymerase 2
Name:Poly [ADP-ribose] polymerase 2
Type:Enzyme
Mol. Mass.:66225.70
Organism:Homo sapiens (Human)
Description:Q9UGN5
Residue:583
BDBM50315798
NameBDBM50315798
Synonyms:(S)-2-(2-Fluoro-4-piperidin-2-yl-phenyl)-1H-benzimidazole-4-carboxamide CHEMBL1089125
TypeSmall organic molecule
Emp. Form.C19H19FN4O
Mol. Mass.338.3788
SMILESNC(=O)c1cccc2[nH]c(nc12)-c1ccc(cc1F)[C@@H]1CCCCN1