Reaction Details
TargetPoly [ADP-ribose] polymerase 1
LigandBDBM50315783
Substrate/Competitorn/a
Meas. Tech.ChEMBL_625251 (CHEMBL1106194)
Ki 2±n/a nM
Citation Penning, TDZhu, GDGong, JThomas, SGandhi, VBLiu, XShi, YKlinghofer, VJohnson, EFPark, CHFry, EHDonawho, CKFrost, DJBuchanan, FGBukofzer, GTRodriguez, LEBontcheva-Diaz, VBouska, JJOsterling, DJOlson, AMMarsh, KCLuo, YGiranda, VL Optimization of phenyl-substituted benzimidazole carboxamide poly(ADP-ribose) polymerase inhibitors: identification of (S)-2-(2-fluoro-4-(pyrrolidin-2-yl)phenyl)-1H-benzimidazole-4-carboxamide (A-966492), a highly potent and efficacious inhibitor. J Med Chem53:3142-53 (2010) 
 
Poly [ADP-ribose] polymerase 1
Name:Poly [ADP-ribose] polymerase 1
Type:n/a
Mol. Mass.:113114.22
Organism:Homo sapiens (Human)
Description:P09874
Residue:1014
BDBM50315783
NameBDBM50315783
Synonyms:2-(4-Piperidin-4-ylphenyl)-1H-benzimidazole-4-carboxamide | CHEMBL1090136
TypeSmall organic molecule
Emp. Form.C19H20N4O
Mol. Mass.320.3883
SMILESNC(=O)c1cccc2[nH]c(nc12)-c1ccc(cc1)C1CCNCC1