Reaction Details
TargetPoly [ADP-ribose] polymerase 1
LigandBDBM50315792
Substrate/Competitorn/a
Meas. Tech.ChEMBL_625251 (CHEMBL1106194)
Ki 2±n/a nM
Citation Penning, TDZhu, GDGong, JThomas, SGandhi, VBLiu, XShi, YKlinghofer, VJohnson, EFPark, CHFry, EHDonawho, CKFrost, DJBuchanan, FGBukofzer, GTRodriguez, LEBontcheva-Diaz, VBouska, JJOsterling, DJOlson, AMMarsh, KCLuo, YGiranda, VL Optimization of phenyl-substituted benzimidazole carboxamide poly(ADP-ribose) polymerase inhibitors: identification of (S)-2-(2-fluoro-4-(pyrrolidin-2-yl)phenyl)-1H-benzimidazole-4-carboxamide (A-966492), a highly potent and efficacious inhibitor. J Med Chem53:3142-53 (2010) 
 
Poly [ADP-ribose] polymerase 1
Name:Poly [ADP-ribose] polymerase 1
Type:n/a
Mol. Mass.:113114.22
Organism:Homo sapiens (Human)
Description:P09874
Residue:1014
BDBM50315792
NameBDBM50315792
Synonyms:6-Fluoro-2-(2-fluoro-4-pyrrolidin-2-ylphenyl)-1H-benzimidazole-4-carboxamide | CHEMBL1088787
TypeSmall organic molecule
Emp. Form.C18H16F2N4O
Mol. Mass.342.3426
SMILESNC(=O)c1cc(F)cc2[nH]c(nc12)-c1ccc(cc1F)C1CCCN1