Reaction Details
TargetSphingosine 1-phosphate receptor 1
LigandBDBM50315803
Substrate/Competitorn/a
Meas. Tech.ChEMBL_626103 (CHEMBL1111629)
EC50 1.1±n/a nM
Citation Hamada, MNakamura, MKiuchi, MMarukawa, KTomatsu, AShimano, KSato, NSugahara, KAsayama, MTakagi, KAdachi, K Removal of sphingosine 1-phosphate receptor-3 (S1P(3)) agonism is essential, but inadequate to obtain immunomodulating 2-aminopropane-1,3-diol S1P(1) agonists with reduced effect on heart rate. J Med Chem53:3154-68 (2010) 
 
Sphingosine 1-phosphate receptor 1
Name:Sphingosine 1-phosphate receptor 1
Type:Enzyme
Mol. Mass.:42836.02
Organism:Homo sapiens (Human)
Description:P21453
Residue:382
BDBM50315803
NameBDBM50315803
Synonyms:2-amino-4-(2-fluoro-4-pentylphenyl)-2-(hydroxymethyl)butyl dihydrogen phosphate | CHEMBL1095889
TypeSmall organic molecule
Emp. Form.C16H27FNO5P
Mol. Mass.363.3614
SMILESCCCCCc1ccc(CCC(N)(CO)COP(O)(O)=O)c(F)c1