Reaction Details
TargetSphingosine 1-phosphate receptor 3
LigandBDBM50315816
Substrate/Competitorn/a
Meas. Tech.ChEMBL_626104 (CHEMBL1111630)
EC50 4.9±n/a nM
Citation Hamada, MNakamura, MKiuchi, MMarukawa, KTomatsu, AShimano, KSato, NSugahara, KAsayama, MTakagi, KAdachi, K Removal of sphingosine 1-phosphate receptor-3 (S1P(3)) agonism is essential, but inadequate to obtain immunomodulating 2-aminopropane-1,3-diol S1P(1) agonists with reduced effect on heart rate. J Med Chem53:3154-68 (2010) 
 
Sphingosine 1-phosphate receptor 3
Name:Sphingosine 1-phosphate receptor 3
Type:G Protein-Coupled Receptor (GPCR)
Mol. Mass.:42278.13
Organism:Homo sapiens (Human)
Description:Q99500
Residue:378
BDBM50315816
NameBDBM50315816
Synonyms:2-Amino-4-(2'-fluoro-4'-phenylthiobiphenyl-4-yl)-2-(phosphoryloxymethyl)butanol | CHEMBL1092286
TypeSmall organic molecule
Emp. Form.C23H25FNO5PS
Mol. Mass.477.485
SMILESNC(CO)(CCc1ccc(cc1)-c1ccc(Sc2ccccc2)cc1F)COP(O)(O)=O