Reaction Details
TargetAurora kinase B
LigandBDBM50315843
Substrate/Competitorn/a
Meas. Tech.ChEMBL_624741 (CHEMBL1113417)
IC50 110±n/a nM
Citation Blanchard, SWilliam, ADLee, ACPoulsen, ATeo, ELDeng, WTu, NTan, EGoh, KLOng, WCNg, CPGoh, KCBonday, ZSun, ET Synthesis and evaluation of alkenyl indazoles as selective Aurora kinase inhibitors. Bioorg Med Chem Lett20:2443-7 (2010) 
 
Aurora kinase B
Name:Aurora kinase B
Type:Protein
Mol. Mass.:39327.72
Organism:Homo sapiens (Human)
Description:Q96GD4
Residue:344
BDBM50315843
NameBDBM50315843
Synonyms:5-nitro-6-(pyrrolidin-1-yl)-3-styryl-1H-indazole | CHEMBL1091974
TypeSmall organic molecule
Emp. Form.C19H18N4O2
Mol. Mass.334.3718
SMILES[O-][N+](=O)c1cc2c(\C=C\c3ccccc3)n[nH]c2cc1N1CCCC1