Reaction Details
TargetAurora kinase A
LigandBDBM50315846
Substrate/Competitorn/a
Meas. Tech.ChEMBL_624739 (CHEMBL1113415)
IC50 160±n/a nM
Citation Blanchard, SWilliam, ADLee, ACPoulsen, ATeo, ELDeng, WTu, NTan, EGoh, KLOng, WCNg, CPGoh, KCBonday, ZSun, ET Synthesis and evaluation of alkenyl indazoles as selective Aurora kinase inhibitors. Bioorg Med Chem Lett20:2443-7 (2010) 
 
Aurora kinase A
Name:Aurora kinase A
Type:Serine/threonine-protein kinase
Mol. Mass.:45830.98
Organism:Homo sapiens (Human)
Description:O14965
Residue:403
BDBM50315846
NameBDBM50315846
Synonyms:5-(pyridin-4-yl)-6-(pyrrolidin-1-yl)-3-styryl-1H-indazole | CHEMBL1090679
TypeSmall organic molecule
Emp. Form.C24H22N4
Mol. Mass.366.4583
SMILESC1CCN(C1)c1cc2[nH]nc(\C=C\c3ccccc3)c2cc1-c1ccncc1