Reaction Details
TargetAurora kinase A
LigandBDBM50315851
Substrate/Competitorn/a
Meas. Tech.ChEMBL_624739 (CHEMBL1113415)
IC50 22±n/a nM
Citation Blanchard, SWilliam, ADLee, ACPoulsen, ATeo, ELDeng, WTu, NTan, EGoh, KLOng, WCNg, CPGoh, KCBonday, ZSun, ET Synthesis and evaluation of alkenyl indazoles as selective Aurora kinase inhibitors. Bioorg Med Chem Lett20:2443-7 (2010) 
 
Aurora kinase A
Name:Aurora kinase A
Type:Serine/threonine-protein kinase
Mol. Mass.:45830.98
Organism:Homo sapiens (Human)
Description:O14965
Residue:403
BDBM50315851
NameBDBM50315851
Synonyms:2-phenyl-N-(3-styryl-1H-indazol-5-yl)acetamide | CHEMBL1090912
TypeSmall organic molecule
Emp. Form.C23H19N3O
Mol. Mass.353.4165
SMILESO=C(Cc1ccccc1)Nc1ccc2[nH]nc(\C=C\c3ccccc3)c2c1