Reaction Details
Target17-beta-hydroxysteroid dehydrogenase type 3
LigandBDBM50266759
Substrate/Competitorn/a
Meas. Tech.ChEMBL_624968 (CHEMBL1108824)
IC50 100±n/a nM
Citation Hu, GXLiang, GChu, YLi, XLian, QQLin, HHe, YHuang, YHardy, DOGe, RS Curcumin derivatives inhibit testicular 17beta-hydroxysteroid dehydrogenase 3. Bioorg Med Chem Lett20:2549-51 (2010) 
 
17-beta-hydroxysteroid dehydrogenase type 3
Name:17-beta-hydroxysteroid dehydrogenase type 3
Type:PROTEIN
Mol. Mass.:34235.73
Organism:Rattus norvegicus
Description:ChEMBL_1510493
Residue:306
BDBM50266759
NameBDBM50266759
Synonyms:(1E,4E)-1,5-bis(4-fluorophenyl)penta-1,4-dien-3-one CHEMBL476220
TypeSmall organic molecule
Emp. Form.C17H12F2O
Mol. Mass.270.2734
SMILESFc1ccc(\C=C\C(=O)\C=C\c2ccc(F)cc2)cc1