Reaction Details
Target17-beta-hydroxysteroid dehydrogenase type 3
LigandBDBM50241208
Substrate/Competitorn/a
Meas. Tech.ChEMBL_624968 (CHEMBL1108824)
IC50>100000±n/a nM
Citation Hu, GXLiang, GChu, YLi, XLian, QQLin, HHe, YHuang, YHardy, DOGe, RS Curcumin derivatives inhibit testicular 17beta-hydroxysteroid dehydrogenase 3. Bioorg Med Chem Lett20:2549-51 (2010) 
 
17-beta-hydroxysteroid dehydrogenase type 3
Name:17-beta-hydroxysteroid dehydrogenase type 3
Type:PROTEIN
Mol. Mass.:34235.73
Organism:Rattus norvegicus
Description:ChEMBL_1510493
Residue:306
BDBM50241208
NameBDBM50241208
Synonyms:(2E,6E)-2,6-bis(3,4,5-trimethoxybenzylidene)cyclohexanone 2,6-bis((3,4,5-trimethoxyphenyl)methylene)-cyclohexanone 2,6-bis-(3,4,5-trimethoxyphenylmethylene)-cyclohexanone | CHEMBL387599
TypeSmall organic molecule
Emp. Form.C26H30O7
Mol. Mass.454.5122
SMILESCOc1cc(\C=C2/CCC\C(=C/c3cc(OC)c(OC)c(OC)c3)C2=O)cc(OC)c1OC