Reaction Details
TargetDual specificity tyrosine-phosphorylation-regulated kinase 1A
LigandBDBM50315888
Substrate/Competitorn/a
Meas. Tech.ChEMBL_624996 (CHEMBL1109664)
IC50>1000±n/a nM
Citation Fidanze, SDErickson, SAWang, GTMantei, RClark, RFSorensen, BKBamaung, NYKovar, PJohnson, EFSwinger, KKStewart, KDZhang, QTucker, LAPappano, WNWilsbacher, JLWang, JSheppard, GSBell, RLDavidsen, SKHubbard, RD Imidazo[2,1-b]thiazoles: multitargeted inhibitors of both the insulin-like growth factor receptor and members of the epidermal growth factor family of receptor tyrosine kinases. Bioorg Med Chem Lett20:2452-5 (2010) 
 
Dual specificity tyrosine-phosphorylation-regulated kinase 1A
Name:Dual specificity tyrosine-phosphorylation-regulated kinase 1A
Type:Enzyme
Mol. Mass.:85616.61
Organism:Homo sapiens (Human)
Description:Q13627
Residue:763
BDBM50315888
NameBDBM50315888
Synonyms:CHEMBL1090360 | N-(3-(5-(2-(3-morpholinophenylamino)pyrimidin-4-yl)imidazo[2,1-b]thiazol-6-yl)phenyl)-2-phenylacetamide
TypeSmall organic molecule
Emp. Form.C33H29N7O2S
Mol. Mass.587.694
SMILESO=C(Cc1ccccc1)Nc1cccc(c1)-c1nc2sccn2c1-c1ccnc(Nc2cccc(c2)N2CCOCC2)n1