Reaction Details
TargetProtein kinase C delta type
LigandBDBM50315888
Substrate/Competitorn/a
Meas. Tech.ChEMBL_625010 (CHEMBL1109678)
IC50>1000±n/a nM
Citation Fidanze, SDErickson, SAWang, GTMantei, RClark, RFSorensen, BKBamaung, NYKovar, PJohnson, EFSwinger, KKStewart, KDZhang, QTucker, LAPappano, WNWilsbacher, JLWang, JSheppard, GSBell, RLDavidsen, SKHubbard, RD Imidazo[2,1-b]thiazoles: multitargeted inhibitors of both the insulin-like growth factor receptor and members of the epidermal growth factor family of receptor tyrosine kinases. Bioorg Med Chem Lett20:2452-5 (2010) 
 
Protein kinase C delta type
Name:Protein kinase C delta type
Type:Enzyme
Mol. Mass.:77516.79
Organism:Homo sapiens (Human)
Description:The recombinant human PKC enzymes were produced using a baculovirus expression system in SF9 cells
Residue:676
BDBM50315888
NameBDBM50315888
Synonyms:CHEMBL1090360 | N-(3-(5-(2-(3-morpholinophenylamino)pyrimidin-4-yl)imidazo[2,1-b]thiazol-6-yl)phenyl)-2-phenylacetamide
TypeSmall organic molecule
Emp. Form.C33H29N7O2S
Mol. Mass.587.694
SMILESO=C(Cc1ccccc1)Nc1cccc(c1)-c1nc2sccn2c1-c1ccnc(Nc2cccc(c2)N2CCOCC2)n1