Reaction Details
TargetInsulin-like growth factor 1 receptor
LigandBDBM50315898
Substrate/Competitorn/a
Meas. Tech.ChEMBL_624976 (CHEMBL1108832)
IC50 81±n/a nM
Citation Fidanze, SDErickson, SAWang, GTMantei, RClark, RFSorensen, BKBamaung, NYKovar, PJohnson, EFSwinger, KKStewart, KDZhang, QTucker, LAPappano, WNWilsbacher, JLWang, JSheppard, GSBell, RLDavidsen, SKHubbard, RD Imidazo[2,1-b]thiazoles: multitargeted inhibitors of both the insulin-like growth factor receptor and members of the epidermal growth factor family of receptor tyrosine kinases. Bioorg Med Chem Lett20:2452-5 (2010) 
 
Insulin-like growth factor 1 receptor
Name:Insulin-like growth factor 1 receptor
Type:Protein
Mol. Mass.:154776.79
Organism:Homo sapiens (Human)
Description:P08069
Residue:1367
BDBM50315898
NameBDBM50315898
Synonyms:CHEMBL1090361 | N-(3-(5-(2-(2-methyl-1,2,3,4-tetrahydroisoquinolin-6-ylamino)pyrimidin-4-yl)imidazo[2,1-b]thiazol-6-yl)phenyl)-2-phenylacetamide
TypeSmall organic molecule
Emp. Form.C33H29N7OS
Mol. Mass.571.695
SMILESCN1CCc2cc(Nc3nccc(n3)-c3c(nc4sccn34)-c3cccc(NC(=O)Cc4ccccc4)c3)ccc2C1