Reaction Details
TargetInsulin-like growth factor 1 receptor
LigandBDBM50315895
Substrate/Competitorn/a
Meas. Tech.ChEMBL_624976 (CHEMBL1108832)
IC50 330±n/a nM
Citation Fidanze, SDErickson, SAWang, GTMantei, RClark, RFSorensen, BKBamaung, NYKovar, PJohnson, EFSwinger, KKStewart, KDZhang, QTucker, LAPappano, WNWilsbacher, JLWang, JSheppard, GSBell, RLDavidsen, SKHubbard, RD Imidazo[2,1-b]thiazoles: multitargeted inhibitors of both the insulin-like growth factor receptor and members of the epidermal growth factor family of receptor tyrosine kinases. Bioorg Med Chem Lett20:2452-5 (2010) 
 
Insulin-like growth factor 1 receptor
Name:Insulin-like growth factor 1 receptor
Type:Protein
Mol. Mass.:154776.79
Organism:Homo sapiens (Human)
Description:P08069
Residue:1367
BDBM50315895
NameBDBM50315895
Synonyms:CHEMBL1090357 | N-(3-(5-(2-(4-(2-(dimethylamino)ethyl)phenylamino)pyrimidin-4-yl)imidazo[2,1-b]thiazol-6-yl)phenyl)-2,6-difluorobenzamide
TypeSmall organic molecule
Emp. Form.C32H27F2N7OS
Mol. Mass.595.665
SMILESCN(C)CCc1ccc(Nc2nccc(n2)-c2c(nc3sccn23)-c2cccc(NC(=O)c3c(F)cccc3F)c2)cc1