Reaction Details
TargetInsulin-like growth factor 1 receptor
LigandBDBM50315901
Substrate/Competitorn/a
Meas. Tech.ChEMBL_624976 (CHEMBL1108832)
IC50>12500±n/a nM
Citation Fidanze, SDErickson, SAWang, GTMantei, RClark, RFSorensen, BKBamaung, NYKovar, PJohnson, EFSwinger, KKStewart, KDZhang, QTucker, LAPappano, WNWilsbacher, JLWang, JSheppard, GSBell, RLDavidsen, SKHubbard, RD Imidazo[2,1-b]thiazoles: multitargeted inhibitors of both the insulin-like growth factor receptor and members of the epidermal growth factor family of receptor tyrosine kinases. Bioorg Med Chem Lett20:2452-5 (2010) 
 
Insulin-like growth factor 1 receptor
Name:Insulin-like growth factor 1 receptor
Type:Protein
Mol. Mass.:154776.79
Organism:Homo sapiens (Human)
Description:P08069
Residue:1367
BDBM50315901
NameBDBM50315901
Synonyms:2-chloro-N-(3-(5-(pyridin-4-yl)imidazo[2,1-b]thiazol-6-yl)phenyl)benzamide | CHEMBL1091613
TypeSmall organic molecule
Emp. Form.C23H15ClN4OS
Mol. Mass.430.909
SMILESClc1ccccc1C(=O)Nc1cccc(c1)-c1nc2sccn2c1-c1ccncc1