Reaction Details
TargetProstaglandin E2 receptor EP3 subtype
LigandBDBM50315982
Substrate/Competitorn/a
Meas. Tech.ChEMBL_625741 (CHEMBL1104418)
Ki 0.2±n/a nM
Citation Asada, MObitsu, TKinoshita, ANakai, YNagase, TSugimoto, ITanaka, MTakizawa, HYoshikawa, KSato, KNarita, MOhuchida, SNakai, HToda, M Discovery of novel N-acylsulfonamide analogs as potent and selective EP3 receptor antagonists. Bioorg Med Chem Lett20:2639-43 (2010) 
 
Prostaglandin E2 receptor EP3 subtype
Name:Prostaglandin E2 receptor EP3 subtype
Type:G-protein coupled receptor
Mol. Mass.:40092.50
Organism:Mus musculus (Mouse)
Description:n/a
Residue:365
BDBM50315982
NameBDBM50315982
Synonyms:3-(4-((1H-pyrazol-1-yl)methyl)-2-phenethoxyphenyl)-N-(3,4-difluorophenylsulfonyl)propanamide | CHEMBL1093820
TypeSmall organic molecule
Emp. Form.C27H25F2N3O4S
Mol. Mass.525.567
SMILESFc1ccc(cc1F)S(=O)(=O)NC(=O)CCc1ccc(Cn2cccn2)cc1OCCc1ccccc1