Reaction Details
TargetProstaglandin E2 receptor EP3 subtype
LigandBDBM50315985
Substrate/Competitorn/a
Meas. Tech.ChEMBL_625741 (CHEMBL1104418)
Ki 0.12±n/a nM
Citation Asada, MObitsu, TKinoshita, ANakai, YNagase, TSugimoto, ITanaka, MTakizawa, HYoshikawa, KSato, KNarita, MOhuchida, SNakai, HToda, M Discovery of novel N-acylsulfonamide analogs as potent and selective EP3 receptor antagonists. Bioorg Med Chem Lett20:2639-43 (2010) 
 
Prostaglandin E2 receptor EP3 subtype
Name:Prostaglandin E2 receptor EP3 subtype
Type:G-protein coupled receptor
Mol. Mass.:40092.50
Organism:Mus musculus (Mouse)
Description:n/a
Residue:365
BDBM50315985
NameBDBM50315985
Synonyms:3-(4-((1H-pyrazol-1-yl)methyl)-2-(2-(methyl(phenyl)amino)ethoxy)phenyl)-N-(3,4-difluorophenylsulfonyl)propanamide | CHEMBL1090937
TypeSmall organic molecule
Emp. Form.C28H28F2N4O4S
Mol. Mass.554.608
SMILESCN(CCOc1cc(Cn2cccn2)ccc1CCC(=O)NS(=O)(=O)c1ccc(F)c(F)c1)c1ccccc1