Reaction Details
TargetAminopeptidase N
LigandBDBM50316049
Substrate/Competitorn/a
Meas. Tech.ChEMBL_623297 (CHEMBL1115220)
IC50 46000±n/a nM
Citation Grzywa, RSokol, AMSienczyk, MRadziszewicz, MKosciolek, BCarty, MPOleksyszyn, J New aromatic monoesters of alpha-aminoaralkylphosphonic acids as inhibitors of aminopeptidase N/CD13. Bioorg Med Chem18:2930-6 (2010) 
 
Aminopeptidase N
Name:Aminopeptidase N
Type:Protein
Mol. Mass.:108810.25
Organism:Sus scrofa (Pig)
Description:P15145
Residue:963
BDBM50316049
NameBDBM50316049
Synonyms:1-amino-3-phenylpropylphosphonic acid | CHEMBL1090914
TypeSmall organic molecule
Emp. Form.C9H14NO3P
Mol. Mass.215.1861
SMILESNC(CCc1ccccc1)P(O)(O)=O