Reaction Details
TargetRAC-gamma serine/threonine-protein kinase
LigandBDBM50316188
Substrate/Competitorn/a
Meas. Tech.ChEMBL_628225 (CHEMBL1109954)
IC50 22±n/a nM
Citation Rouse, MBSeefeld, MALeber, JDMcNulty, KCSun, LMiller, WHZhang, SMinthorn, EAConcha, NOChoudhry, AESchaber, MDHeerding, DA Aminofurazans as potent inhibitors of AKT kinase. Bioorg Med Chem Lett19:1508-11 (2009) 
 
RAC-gamma serine/threonine-protein kinase
Name:RAC-gamma serine/threonine-protein kinase
Type:Enzyme
Mol. Mass.:55769.36
Organism:Homo sapiens (Human)
Description:n/a
Residue:479
BDBM50316188
NameBDBM50316188
Synonyms:4-(2-(4-amino-1,2,5-oxadiazol-3-yl)-1-ethyl-6-(pyrrolidin-1-ylmethyl)-1H-imidazo[4,5-c]pyridin-4-yl)-2-methylbut-3-yn-2-ol | CHEMBL1096290
TypeSmall organic molecule
Emp. Form.C20H25N7O2
Mol. Mass.395.4582
SMILESCCn1c(nc2c(nc(CN3CCCC3)cc12)C#CC(C)(C)O)-c1nonc1N