Reaction Details
TargetRAC-alpha serine/threonine-protein kinase
LigandBDBM50316192
Substrate/Competitorn/a
Meas. Tech.ChEMBL_628223 (CHEMBL1109952)
Ki 0.4±n/a nM
Citation Rouse, MBSeefeld, MALeber, JDMcNulty, KCSun, LMiller, WHZhang, SMinthorn, EAConcha, NOChoudhry, AESchaber, MDHeerding, DA Aminofurazans as potent inhibitors of AKT kinase. Bioorg Med Chem Lett19:1508-11 (2009) 
 
RAC-alpha serine/threonine-protein kinase
Name:RAC-alpha serine/threonine-protein kinase
Type:Enzyme
Mol. Mass.:55681.25
Organism:Homo sapiens (Human)
Description:P31749
Residue:480
BDBM50316192
NameBDBM50316192
Synonyms:4-(2-(4-amino-1,2,5-oxadiazol-3-yl)-6-((R)-2-amino-1-phenylethoxy)-1-ethyl-1H-imidazo[4,5-c]pyridin-4-yl)-2-methylbut-3-yn-2-ol GSK screening, 28
TypeSmall organic molecule
Emp. Form.C23H25N7O3
Mol. Mass.447.4897
SMILESCCn1c(nc2c(nc(O[C@@H](CN)c3ccccc3)cc12)C#CC(C)(C)O)-c1nonc1N