Reaction Details
TargetAdenosine receptor A2a
LigandBDBM50233816
Substrate/Competitorn/a
Meas. Tech.ChEMBL_628240 (CHEMBL1110930)
IC50 6±n/a nM
Citation Mantell, SJStephenson, PTMonaghan, SMMaw, GNTrevethick, MAYeadon, MWalker, DKSelby, MDBatchelor, DVRozze, SChavaroche, HLemaitre, AWright, KNWhitlock, LStuart, EFWright, PAMacintyre, F SAR of a series of inhaled A(2A) agonists and comparison of inhaled pharmacokinetics in a preclinical model with clinical pharmacokinetic data. Bioorg Med Chem Lett19:4471-5 (2009) 
 
Adenosine receptor A2a
Name:Adenosine receptor A2a
Type:G Protein-Coupled Receptor (GPCR)
Mol. Mass.:44716.46
Organism:Homo sapiens (Human)
Description:P29274
Residue:412
BDBM50233816
NameBDBM50233816
Synonyms:(2S,3S,4R,5R)-5-(2-((3-(2-(cyclopentyl(isopropyl)amino)ethyl)ureido)methyl)-6-(2,2-diphenylethylamino)-9H-purin-9-yl)-N-ethyl-3,4-dihydroxytetrahydrofuran-2-carboxamide CHEMBL272761
TypeSmall organic molecule
Emp. Form.C38H51N9O5
Mol. Mass.713.8688
SMILESCCNC(=O)[C@H]1O[C@H]([C@H](O)[C@@H]1O)n1cnc2c(NCC(c3ccccc3)c3ccccc3)nc(CNC(=O)NCCN(C(C)C)C3CCCC3)nc12