Reaction Details
TargetAdenosine receptor A2a
LigandBDBM50316205
Substrate/Competitorn/a
Meas. Tech.ChEMBL_628240 (CHEMBL1110930)
IC50 5±n/a nM
Citation Mantell, SJStephenson, PTMonaghan, SMMaw, GNTrevethick, MAYeadon, MWalker, DKSelby, MDBatchelor, DVRozze, SChavaroche, HLemaitre, AWright, KNWhitlock, LStuart, EFWright, PAMacintyre, F SAR of a series of inhaled A(2A) agonists and comparison of inhaled pharmacokinetics in a preclinical model with clinical pharmacokinetic data. Bioorg Med Chem Lett19:4471-5 (2009) 
 
Adenosine receptor A2a
Name:Adenosine receptor A2a
Type:G Protein-Coupled Receptor (GPCR)
Mol. Mass.:44716.46
Organism:Homo sapiens (Human)
Description:P29274
Residue:412
BDBM50316205
NameBDBM50316205
Synonyms:CHEMBL1096889 | N-(2-(3-(2-(diisopropylamino)ethyl)ureido)ethyl)-6-(2,2-diphenylethylamino)-9-((2R,3R,4S,5S)-5-(ethylcarbamoyl)-3,4-dihydroxytetrahydrofuran-2-yl)-9H-purine-2-carboxamide
TypeSmall organic molecule
Emp. Form.C38H52N10O6
Mol. Mass.744.8829
SMILESCCNC(=O)[C@H]1O[C@H]([C@H](O)[C@@H]1O)n1cnc2c(NCC(c3ccccc3)c3ccccc3)nc(nc12)C(=O)NCCNC(=O)NCCN(C(C)C)C(C)C