Reaction Details
TargetAdenosine receptor A2a
LigandBDBM50316213
Substrate/Competitorn/a
Meas. Tech.ChEMBL_628240 (CHEMBL1110930)
IC50 0.4±n/a nM
Citation Mantell, SJStephenson, PTMonaghan, SMMaw, GNTrevethick, MAYeadon, MWalker, DKSelby, MDBatchelor, DVRozze, SChavaroche, HLemaitre, AWright, KNWhitlock, LStuart, EFWright, PAMacintyre, F SAR of a series of inhaled A(2A) agonists and comparison of inhaled pharmacokinetics in a preclinical model with clinical pharmacokinetic data. Bioorg Med Chem Lett19:4471-5 (2009) 
 
Adenosine receptor A2a
Name:Adenosine receptor A2a
Type:G Protein-Coupled Receptor (GPCR)
Mol. Mass.:44716.46
Organism:Homo sapiens (Human)
Description:P29274
Residue:412
BDBM50316213
NameBDBM50316213
Synonyms:4-((3-(2-(6-(2,2-diphenylethylamino)-9-((2R,3R,4S,5S)-5-(ethylcarbamoyl)-3,4-dihydroxytetrahydrofuran-2-yl)-9H-purine-2-carboxamido)ethyl)ureido)methyl)benzoic acid | CHEMBL1095604
TypeSmall organic molecule
Emp. Form.C38H41N9O8
Mol. Mass.751.7876
SMILESCCNC(=O)[C@H]1O[C@H]([C@H](O)[C@@H]1O)n1cnc2c(NCC(c3ccccc3)c3ccccc3)nc(nc12)C(=O)NCCNC(=O)NCc1ccc(cc1)C(O)=O