Reaction Details
TargetPoly [ADP-ribose] polymerase 1
LigandBDBM50316237
Substrate/Competitorn/a
Meas. Tech.ChEMBL_628377 (CHEMBL1115415)
IC50 2.1±n/a nM
Citation Jones, PAltamura, SBoueres, JFerrigno, FFonsi, MGiomini, CLamartina, SMonteagudo, EOntoria, JMOrsale, MVPalumbi, MCPesci, SRoscilli, GScarpelli, RSchultz-Fademrecht, CToniatti, CRowley, M Discovery of 2-{4-[(3S)-piperidin-3-yl]phenyl}-2H-indazole-7-carboxamide (MK-4827): a novel oral poly(ADP-ribose)polymerase (PARP) inhibitor efficacious in BRCA-1 and -2 mutant tumors. J Med Chem52:7170-85 (2009) 
 
Poly [ADP-ribose] polymerase 1
Name:Poly [ADP-ribose] polymerase 1
Type:n/a
Mol. Mass.:113114.22
Organism:Homo sapiens (Human)
Description:P09874
Residue:1014
BDBM50316237
NameBDBM50316237
Synonyms:2-(4-{[(2-Fluoroethyl)amino]methyl}phenyl)-2H-indazole-7-carboxamide | CHEMBL1096883
TypeSmall organic molecule
Emp. Form.C17H17FN4O
Mol. Mass.312.3415
SMILESNC(=O)c1cccc2cn(nc12)-c1ccc(CNCCF)cc1