Reaction Details
TargetPoly [ADP-ribose] polymerase 1
LigandBDBM50306210
Substrate/Competitorn/a
Meas. Tech.ChEMBL_628377 (CHEMBL1115415)
IC50 3.8±n/a nM
Citation Jones, PAltamura, SBoueres, JFerrigno, FFonsi, MGiomini, CLamartina, SMonteagudo, EOntoria, JMOrsale, MVPalumbi, MCPesci, SRoscilli, GScarpelli, RSchultz-Fademrecht, CToniatti, CRowley, M Discovery of 2-{4-[(3S)-piperidin-3-yl]phenyl}-2H-indazole-7-carboxamide (MK-4827): a novel oral poly(ADP-ribose)polymerase (PARP) inhibitor efficacious in BRCA-1 and -2 mutant tumors. J Med Chem52:7170-85 (2009) 
 
Poly [ADP-ribose] polymerase 1
Name:Poly [ADP-ribose] polymerase 1
Type:n/a
Mol. Mass.:113114.22
Organism:Homo sapiens (Human)
Description:P09874
Residue:1014
BDBM50306210
NameBDBM50306210
Synonyms:2-(4-((methylamino)methyl)phenyl)-2H-indazole-7-carboxamide | CHEMBL609862
TypeSmall organic molecule
Emp. Form.C16H16N4O
Mol. Mass.280.3244
SMILESCNCc1ccc(cc1)-n1cc2cccc(C(N)=O)c2n1