Reaction Details
TargetPoly [ADP-ribose] polymerase 1
LigandBDBM50316240
Substrate/Competitorn/a
Meas. Tech.ChEMBL_628377 (CHEMBL1115415)
IC50 31±n/a nM
Citation Jones, PAltamura, SBoueres, JFerrigno, FFonsi, MGiomini, CLamartina, SMonteagudo, EOntoria, JMOrsale, MVPalumbi, MCPesci, SRoscilli, GScarpelli, RSchultz-Fademrecht, CToniatti, CRowley, M Discovery of 2-{4-[(3S)-piperidin-3-yl]phenyl}-2H-indazole-7-carboxamide (MK-4827): a novel oral poly(ADP-ribose)polymerase (PARP) inhibitor efficacious in BRCA-1 and -2 mutant tumors. J Med Chem52:7170-85 (2009) 
 
Poly [ADP-ribose] polymerase 1
Name:Poly [ADP-ribose] polymerase 1
Type:n/a
Mol. Mass.:113114.22
Organism:Homo sapiens (Human)
Description:P09874
Residue:1014
BDBM50316240
NameBDBM50316240
Synonyms:2-{4-[(4-Methylpiperazin-1-yl)methyl]phenyl}-2H-indazole-7-carboxamide | CHEMBL1094632
TypeSmall organic molecule
Emp. Form.C20H23N5O
Mol. Mass.349.4295
SMILESCN1CCN(Cc2ccc(cc2)-n2cc3cccc(C(N)=O)c3n2)CC1