Reaction Details
TargetHepatocyte growth factor receptor
LigandBDBM50316253
Substrate/Competitorn/a
Meas. Tech.ChEMBL_628522 (CHEMBL1104644)
IC50>50000±n/a nM
Citation Verheijen, JCRichard, DJCurran, KKaplan, JLefever, MNowak, PMalwitz, DJBrooijmans, NToral-Barza, LZhang, WGLucas, JHollander, IAyral-Kaloustian, SMansour, TSYu, KZask, A Discovery of 4-morpholino-6-aryl-1H-pyrazolo[3,4-d]pyrimidines as highly potent and selective ATP-competitive inhibitors of the mammalian target of rapamycin (mTOR): optimization of the 6-aryl substituent. J Med Chem52:8010-24 (2009) 
 
Hepatocyte growth factor receptor
Name:Hepatocyte growth factor receptor
Type:Protein
Mol. Mass.:155559.73
Organism:Homo sapiens (Human)
Description:P08581
Residue:1390
BDBM50316253
NameBDBM50316253
Synonyms:CHEMBL1095627 | tert-Butyl 4-(6-(4-aminophenyl)-4-morpholino-1H-pyrazolo[3,4-d]pyrimidin-1-yl)piperidine-1-carboxylate
TypeSmall organic molecule
Emp. Form.C25H33N7O3
Mol. Mass.479.5746
SMILESCC(C)(C)OC(=O)N1CCC(CC1)n1ncc2c(nc(nc12)-c1ccc(N)cc1)N1CCOCC1