Reaction Details
TargetSerine/threonine-protein kinase mTOR
LigandBDBM50316257
Substrate/Competitorn/a
Meas. Tech.ChEMBL_628491 (CHEMBL1104613)
IC50 0.30±n/a nM
Citation Verheijen, JCRichard, DJCurran, KKaplan, JLefever, MNowak, PMalwitz, DJBrooijmans, NToral-Barza, LZhang, WGLucas, JHollander, IAyral-Kaloustian, SMansour, TSYu, KZask, A Discovery of 4-morpholino-6-aryl-1H-pyrazolo[3,4-d]pyrimidines as highly potent and selective ATP-competitive inhibitors of the mammalian target of rapamycin (mTOR): optimization of the 6-aryl substituent. J Med Chem52:8010-24 (2009) 
 
Serine/threonine-protein kinase mTOR
Name:Serine/threonine-protein kinase mTOR
Type:Rapamycin target protein
Mol. Mass.:288917.12
Organism:Homo sapiens (Human)
Description:P42345
Residue:2549
BDBM50316257
NameBDBM50316257
Synonyms:1-{4-[1-(1-benzylpiperidin-4-yl)-4-morpholin-4-yl-1H-pyrazolo[3,4-d]pyrimidin-6-yl]phenyl}-3-(2-hydroxyethyl)urea | CHEMBL1097896
TypeSmall organic molecule
Emp. Form.C30H36N8O3
Mol. Mass.556.6586
SMILESOCCNC(=O)Nc1ccc(cc1)-c1nc(N2CCOCC2)c2cnn(C3CCN(Cc4ccccc4)CC3)c2n1