Reaction Details
TargetSerine/threonine-protein kinase mTOR
LigandBDBM50316265
Substrate/Competitorn/a
Meas. Tech.ChEMBL_628491 (CHEMBL1104613)
IC50 0.70±n/a nM
Citation Verheijen, JCRichard, DJCurran, KKaplan, JLefever, MNowak, PMalwitz, DJBrooijmans, NToral-Barza, LZhang, WGLucas, JHollander, IAyral-Kaloustian, SMansour, TSYu, KZask, A Discovery of 4-morpholino-6-aryl-1H-pyrazolo[3,4-d]pyrimidines as highly potent and selective ATP-competitive inhibitors of the mammalian target of rapamycin (mTOR): optimization of the 6-aryl substituent. J Med Chem52:8010-24 (2009) 
 
Serine/threonine-protein kinase mTOR
Name:Serine/threonine-protein kinase mTOR
Type:Rapamycin target protein
Mol. Mass.:288917.12
Organism:Homo sapiens (Human)
Description:P42345
Residue:2549
BDBM50316265
NameBDBM50316265
Synonyms:4-(4-morpholino-6-(4-(3-(4-(2-(pyrrolidin-1-yl)ethyl)phenyl)ureido)phenyl)-1H-pyrazolo[3,4-d]pyrimidin-1-yl)piperidine-1-carboxylate | CHEMBL1098246
TypeSmall organic molecule
Emp. Form.C35H43N9O4
Mol. Mass.653.7738
SMILESCOC(=O)N1CCC(CC1)n1ncc2c(nc(nc12)-c1ccc(NC(=O)Nc2ccc(CCN3CCCC3)cc2)cc1)N1CCOCC1