Reaction Details
TargetPhosphatidylinositol 4,5-bisphosphate 3-kinase catalytic subunit alpha isoform
LigandBDBM50316262
Substrate/Competitorn/a
Meas. Tech.ChEMBL_628492 (CHEMBL1104614)
IC50 898±n/a nM
Citation Verheijen, JCRichard, DJCurran, KKaplan, JLefever, MNowak, PMalwitz, DJBrooijmans, NToral-Barza, LZhang, WGLucas, JHollander, IAyral-Kaloustian, SMansour, TSYu, KZask, A Discovery of 4-morpholino-6-aryl-1H-pyrazolo[3,4-d]pyrimidines as highly potent and selective ATP-competitive inhibitors of the mammalian target of rapamycin (mTOR): optimization of the 6-aryl substituent. J Med Chem52:8010-24 (2009) 
 
Phosphatidylinositol 4,5-bisphosphate 3-kinase catalytic subunit alpha isoform
Name:Phosphatidylinositol 4,5-bisphosphate 3-kinase catalytic subunit alpha isoform
Type:Enzyme Subunit
Mol. Mass.:124294.87
Organism:Homo sapiens (Human)
Description:P42336
Residue:1068
BDBM50316262
NameBDBM50316262
Synonyms:CHEMBL1098243 | tert-butyl 4-(6-{4-[(cyclopropylcarbamoyl)amino]phenyl}-4-morpholin-4-yl-1Hpyrazolo[3,4-d]pyrimidin-1-yl)piperidine-1-carboxylate
TypeSmall organic molecule
Emp. Form.C29H38N8O4
Mol. Mass.562.6632
SMILESCC(C)(C)OC(=O)N1CCC(CC1)n1ncc2c(nc(nc12)-c1ccc(NC(=O)NC2CC2)cc1)N1CCOCC1