Reaction Details
TargetSerine/threonine-protein kinase ATR
LigandBDBM35585
Substrate/Competitorn/a
Meas. Tech.ChEMBL_628496 (CHEMBL1104618)
IC50 4800±n/a nM
Citation Verheijen, JCRichard, DJCurran, KKaplan, JLefever, MNowak, PMalwitz, DJBrooijmans, NToral-Barza, LZhang, WGLucas, JHollander, IAyral-Kaloustian, SMansour, TSYu, KZask, A Discovery of 4-morpholino-6-aryl-1H-pyrazolo[3,4-d]pyrimidines as highly potent and selective ATP-competitive inhibitors of the mammalian target of rapamycin (mTOR): optimization of the 6-aryl substituent. J Med Chem52:8010-24 (2009) 
 
Serine/threonine-protein kinase ATR
Name:Serine/threonine-protein kinase ATR
Type:Protein
Mol. Mass.:301404.58
Organism:Homo sapiens (Human)
Description:Q13535
Residue:2644
BDBM35585
NameBDBM35585
Synonyms:pyrazolo pyrimidine, 18
TypeSmall organic molecule
Emp. Form.C24H30N8O4
Mol. Mass.494.5462
SMILESCNC(=O)Nc1ccc(cc1)-c1nc(N2CCOCC2)c2cnn(C3CCN(CC3)C(=O)OC)c2n1