Reaction Details
TargetSerine/threonine-protein kinase ATR
LigandBDBM50316255
Substrate/Competitorn/a
Meas. Tech.ChEMBL_628496 (CHEMBL1104618)
IC50 7700±n/a nM
Citation Verheijen, JCRichard, DJCurran, KKaplan, JLefever, MNowak, PMalwitz, DJBrooijmans, NToral-Barza, LZhang, WGLucas, JHollander, IAyral-Kaloustian, SMansour, TSYu, KZask, A Discovery of 4-morpholino-6-aryl-1H-pyrazolo[3,4-d]pyrimidines as highly potent and selective ATP-competitive inhibitors of the mammalian target of rapamycin (mTOR): optimization of the 6-aryl substituent. J Med Chem52:8010-24 (2009) 
 
Serine/threonine-protein kinase ATR
Name:Serine/threonine-protein kinase ATR
Type:Protein
Mol. Mass.:301404.58
Organism:Homo sapiens (Human)
Description:Q13535
Residue:2644
BDBM50316255
NameBDBM50316255
Synonyms:CHEMBL1095932 | Isopropyl 4-(6-(4-(3-Methylureido)phenyl)-4-morpholino-1Hpyrazolo[3,4-d]pyrimidin-1-yl)piperidine-1-carboxylate
TypeSmall organic molecule
Emp. Form.C26H34N8O4
Mol. Mass.522.5994
SMILESCNC(=O)Nc1ccc(cc1)-c1nc(N2CCOCC2)c2cnn(C3CCN(CC3)C(=O)OC(C)C)c2n1