Reaction Details
TargetSerine/threonine-protein kinase ATR
LigandBDBM35590
Substrate/Competitorn/a
Meas. Tech.ChEMBL_628496 (CHEMBL1104618)
IC50 41500±n/a nM
Citation Verheijen, JCRichard, DJCurran, KKaplan, JLefever, MNowak, PMalwitz, DJBrooijmans, NToral-Barza, LZhang, WGLucas, JHollander, IAyral-Kaloustian, SMansour, TSYu, KZask, A Discovery of 4-morpholino-6-aryl-1H-pyrazolo[3,4-d]pyrimidines as highly potent and selective ATP-competitive inhibitors of the mammalian target of rapamycin (mTOR): optimization of the 6-aryl substituent. J Med Chem52:8010-24 (2009) 
 
Serine/threonine-protein kinase ATR
Name:Serine/threonine-protein kinase ATR
Type:Protein
Mol. Mass.:301404.58
Organism:Homo sapiens (Human)
Description:Q13535
Residue:2644
BDBM35590
NameBDBM35590
Synonyms:pyrazolo pyrimidine, 22
TypeSmall organic molecule
Emp. Form.C25H31FN8O4
Mol. Mass.526.5632
SMILESCOC(=O)N1CCC(CC1)n1ncc2c(nc(nc12)-c1ccc(NC(=O)NCCF)cc1)N1CCOCC1