Reaction Details
TargetAldo-keto reductase family 1 member B1
LigandBDBM50237838
Substrate/Competitorn/a
Meas. Tech.ChEMBL_627900 (CHEMBL1103716)
IC50 741±n/a nM
Citation Koukoulitsa, CBailly, FPegklidou, KDemopoulos, VJCotelle, P Evaluation of aldose reductase inhibition and docking studies of 6'-nitro and 6',6''-dinitrorosmarinic acids. Eur J Med Chem45:1663-6 (2010) 
 
Aldo-keto reductase family 1 member B1
Name:Aldo-keto reductase family 1 member B1
Type:Protein
Mol. Mass.:35855.50
Organism:Homo sapiens (Human)
Description:P15121. 4LAU; 2IKI; 4LB4; 2FZD; 2FZ8; 1US0
Residue:316
BDBM50237838
NameBDBM50237838
Synonyms:(R)-3-(4,5-dihydroxy-2-nitrophenyl)-2-(3-(4,5-dihydroxy-2-nitrophenyl)acryloyloxy)propanoic acid CHEMBL261703
TypeSmall organic molecule
Emp. Form.C18H14N2O12
Mol. Mass.450.31
SMILESOC(=O)[C@@H](Cc1cc(O)c(O)cc1[N+]([O-])=O)OC(=O)\C=C\c1cc(O)c(O)cc1[N+]([O-])=O