Reaction Details
TargetPhospholipase A2, major isoenzyme
LigandBDBM50316444
Substrate/Competitorn/a
Meas. Tech.ChEMBL_630281 (CHEMBL1108229)
IC50>25000±n/a nM
Citation Meddad-Belhabich, NAoun, DDjimdé, ARedeuilh, CDive, GMassicot, FChau, FHeymans, FLamouri, A Design of new potent and selective secretory phospholipase A(2) inhibitors. 6-Synthesis, structure-activity relationships and molecular modelling of 1-substituted-4-[4,5-dihydro-1,2,4-(4H)-oxadiazol-5-one-3-yl(methyl)]-functionalized aryl piperazin/one/dione derivatives. Bioorg Med Chem18:3588-600 (2010) 
 
Phospholipase A2, major isoenzyme
Name:Phospholipase A2, major isoenzyme
Type:Hydrolase; monomer or homodimer
Mol. Mass.:16279.83
Organism:Sus scrofa (pig)
Description:Purchased from Sigma.
Residue:146
BDBM50316444
NameBDBM50316444
Synonyms:1-[4-(4,5-Dihydro-1,2,4(4H)-5-oxo-oxadiazol-3-yl)benzyl]-4-tetradecylpiperazin-2-one | CHEMBL1094902
TypeSmall organic molecule
Emp. Form.C27H42N4O3
Mol. Mass.470.6474
1CCN(Cc2ccc(cc2)-c2nc(=O)o[nH]2)C(=O)C1